{"text_format":"1","workbook":"xlsx","n_sheets":7,"sheets":["Instructivo","Estructura","Diagnóstico_RR","Formulas","Segunda línea","Mapa de Aseguramiento","Hoja2"],"not_rendered":{"charts":0,"images":2,"macros":1,"external_links":0,"defined_names":3,"comments":1,"pivot_tables":0},"unopened":[],"bounds":{"document_bytes":16777216,"sheet_cells":100000,"rows_first":2000,"rows_last":500,"rows_between":2000,"halvings":0,"cell_chars":16384,"cell_head_chars":4096},"cells_cut":0,"cells_raw":0,"read":"whole","date_system":"1900"}

{"sheet":"Instructivo","index":0,"n_rows":7,"n_cols":3,"rows_kept":7,"cut":false,"hidden":false,"merged":[[1,1,1,17],[3,1,3,17],[6,2,90,16]]}
[]
[null,"ESTRUCTURA LÍNEAS DE DEFENSA "]
[]
[null,"INSTRUCCIONES DE DILIGENCIAMIENTO"]
[]
[]
[null,null,"Este archivo hace parte de un conjunto de herramientas que le permitirán desarrollar un ejercicio de identificación del modelo de las líneas de defensa  con el propósito de que la entidad establezca e identifique las responsabilidades y roles que se distribuye a través de sus servidores frente a la gestión del riesgo y el control. Este instrumento se constituye como una guía para facilitar el proceso de estructuración de las líneas de defensa. \nEste archivo cuenta con cuatro (4) hojas de Excel de interés para quien lo diligencie, las cuales se explicaran a continuación:\n\nESTRUCTURA LÍNEAS DE DEFENSA:\n\nLa presentación de este archivo busca que el usuario conozca los conceptos básicos para desarrollar el ejercicio de líneas de defensa en su entidad.  Por esta razón, presenta la estructura de cada una de las líneas de defensa consideradas en este modelo a través de la descripción de sus integrantes y las responsabilidades generales ; dicha estructura corresponde a la presentada en el Manual Operativo del MIPG - Versión 2. \n\nDIAGNÓSTICO DE ROLES Y RESPONSABILIDADES:\n\nCorresponde al primer archivo que el usuario debe diligenciar, para ello debe tener en cuenta las siguientes consideraciones:\n\nAspectos claves de éxito: corresponden a los programas, proyectos, procesos, sistemas, entre otros de la entidad que agregan valor para el cumplimiento de los objetivos institucionales. El listado presentado corresponde a un ejemplo de algunos aspectos claves los cuales pueden ser modificados y ajustados a la operación de la entidad.  \n\nResponsables- Cargo: Corresponde a los posibles cargos que se pueden encontrar en una entidad. El listado presentado corresponde a un ejemplo de algunos cargos. \n\nModo de diligenciamiento: teniendo en cuenta los aspectos claves de éxito listados sobre las filas y los responsables listados sobre las columnas, se deben identificar los responsables sobre cada uno de los componentes de los aspectos claves. En la parte superior del archivo se presentan cuatro componentes (Planear, Aprobar, Ejecutar y Verificar) que deben ser ubicados en la casilla en la que se entrecruce un aspecto clave de éxito con un responsable. Cada componente asociado a un aspecto puede tener uno o más responsables por lo que puede estar ubicado en una o más casillas al mismo tiempo. \nA continuación se presenta un ejemplo de diligenciamiento: \n \nComo se evidencia en el ejemplo del aspecto clave de éxito de la gestión del talento humano, la responsabilidad sobre los cuatro componentes recae sobre 3 cargos de la siguiente manera:\nRepresentante legal: Aprua\nJefe de Oficina (quien en este caso puede ser el director o coordinador de talento humano) – Planea, Verifica y Ejecuta. \nProfesional – Ejecuta. \nEn el ejemplo, el jefe de oficina y el profesional llevan a cabo tareas de ejecución porque pueden ejecutar diferentes etapas asociadas a la gestión del talento humano. De la misma manera, en la práctica cada uno de los componentes (Planear, Verificar, Aprobar y Ejecutar) puede ser llevado a cabo por uno o más cargos o responsables.\n \nIDENTIFICACIÓN SEGUNDA LINEA DE DEFENSA \n\nEl archivo asociado a la identificación de la segunda línea de defensa tiene en cuenta los aspectos clave de éxito enunciados en el archivo de diagnóstico de roles y responsabilidades. El objetivo de este documento es identificar para cuales actividades de éxito existe una segunda línea de defensa y para cuáles no. \nEl diligenciamiento de cada una de las columnas del archivo se describe a continuación: \nAspectos clave de éxito: son los mismos aspectos clave enunciados en el archivo de roles y responsabilidades y sobre los cuales se evaluara la existencia de una segunda línea de defensa.\nRiesgo Asociado: para cada uno de los aspectos clave se deben identificar uno o más riesgos sobre los cuales se han establecido controles. \nResponsable: Al interior de la entidad debe haber uno o varios responsables sobre un aspecto clave de éxito. En esta casilla deben colocarse todos los responsables de los que se tenga conocimiento están asociados al aspecto clave de éxito. \nÁrea Funcional: Los responsables pertenecen a áreas funcionales por lo que se debe identificar las mismas. Por otro lado, existe la posibilidad de que no haya un responsable individual de un aspecto de éxito sino que dicha responsabilidad recaiga en un área funcional como un todo. En este caso, se debe identificar el área encargada. \n\nUna vez se identifiquen los aspectos clave de éxito, los riesgos asociados al mismo y los responsables del aspecto clave, se procede a identificar si estos pertenecen o no a la segunda línea de defensa. Para tales fines se debe dar respuesta a 3 preguntas que se definen como 3 criterios. \nCriterios para la identificación de la segunda línea de defensa: \n• ¿El responsable o área funcional encargada del aspecto clave de éxito pertenece a la Media o Alta Gerencia?\n• ¿El área funcional o responsable responde ante la Alta Dirección por el aspecto clave de éxito?\n• ¿El área funcional o responsable realiza actividades de seguimiento?\nEn caso de que la respuesta sea afirmativa, se debe colocar una X en la casilla asociada a cada una de las preguntas. \nClasificación: esta casilla se llena automáticamente una vez se responden los criterios para la identificación de la segunda línea de defensa. De esta manera, el usuario sabrá de inmediato si de acuerdo a las características identificadas el responsable pertenece a la primera o a la segunda línea de defensa. \nPara las actividades en las que la clasificación resulte en la primera línea de defensa no se debe seguir diligenciando el archivo. Por otro lado, aquellas actividades para las que se identifique una segunda línea de defensa deben diligenciar las columnas restantes. \nFunciones de aseguramiento: las funciones de aseguramiento son aquellas funciones que se llevan a cabo sobre los controles que se han establecido en la primera línea de defensa. Una función de aseguramiento tiene un carácter global a comparación de los controles que han sido establecidos de manera directa para el manejo de riesgos. \nCriterios evaluadores de la función de aseguramiento: Existen 4 criterios bajo los cuales se evalúa si una función de aseguramiento ha sido establecida de manera adecuada: \n• Establecimiento del objetivo y alcance de la función de aseguramiento. \n• Metodología establecida para la función de aseguramiento. \n• Si la función de aseguramiento cuenta con responsables claramente definidos. \n• Metodología para la comunicación de resultados y el manejo de información. \nEn la casilla asociada a cada uno de estos criterios el usuario debe colocar un numero entre 1 y 5 de acuerdo a como considere se lleve dicha tarea en su entidad. Una vez se han colocado los 4 valores, se obtendrá un total que determinará el nivel de confianza de aseguramiento provisto por la función descrita. Dicho nivel de confianza puede ser bajo, medio o alto. \nLas columnas no especificadas en este instructivo se diligencian de manera automática a medida que el usuario agrega información dentro del archivo. \n\nINTERPRETACIÓN NIVEL DE ASEGURAMIENTO\n\nEste archivo es de carácter informativo y se presenta con el objetivo de que el usuario pueda interpretar con mayor facilidad que quiere decir tener un nivel bajo, medio o alto de aseguramiento y cuáles son las implicaciones que dicha valoración puede traer y las acciones que se deben tomar. \n\nMAPA DE ASEGURAMIENTO \n\nEl mapa de aseguramiento busca consolidar la información de la segunda y tercera líneas de defensa de la entidad relacionando los aspectos clave de éxito, los riesgos asociados al mismo, sus responsables y áreas funcionales. \nLa información aquí consolidada proviene de los otros archivos que han sido previamente diligenciados. \n\n"]

{"sheet":"Estructura","index":1,"n_rows":10,"n_cols":4,"rows_kept":10,"cut":false,"hidden":false,"merged":[[0,1,1,1],[0,2,0,3],[1,2,1,3],[3,1,3,2]]}
[null,null,"ESTRUCTURA LÍNEAS DE DEFENSA "]
[null,null,"INSTITUTO DISTRITAL DE TURISMO"]
[]
[]
[]
[null,"LÍNEAS DE DEFENSA ","INTEGRANTES ","RESPONSABILIDAD"]
[null,"Línea Estratégica","Alta Dirección y Comité Institucional de Coordinación de Control Interno.\n","Tendrá la responsabilidad de definir el marco general para la gestión del riesgo (política de administración del riesgo) y garantizar el cumplimiento de los planes de la entidad.\n\nAnaliza los riesgos y amenazas institucionales al cumplimiento del os planes estratégicos (objetivos, metas, indicadores)"]
[null,"Primera Línea de Defensa","Dependiendo de la estructura organizacional de la entidad (organigrama), Líderes de proceso y sus equipos (En general servidores públicos en todos los niveles de la organización).","Garantizan la gestión en el día a día, en conjunto con sus equipos de trabajo.\n\nSe encarga de identificar, evaluar, controlar y mitigar los riesgos.\n\nSon responsables de implementar acciones correctivas y detectar fallas en los controles."]
{"$rows_left_out":3}
{"sheet":"Diagnóstico_RR","index":2,"n_rows":267,"n_cols":5,"rows_kept":267,"cut":false,"hidden":true,"merged":[[169,0,176,0],[169,1,176,1],[178,0,185,0],[178,1,185,1],[142,0,149,0],[142,1,149,1],[151,1,158,1],[151,0,158,0],[160,0,167,0],[160,1,167,1],[115,0,122,0],[115,1,122,1],[124,0,131,0],[124,1,131,1],[133,0,140,0],[133,1,140,1],[88,1,95,1],[88,0,95,0],[97,0,104,0],[97,1,104,1],[106,0,113,0],[106,1,113,1],[61,0,68,0],[61,1,68,1],[70,0,77,0],[70,1,77,1],[79,0,86,0],[79,1,86,1],[34,0,41,0],[34,1,41,1],[43,0,50,0],[43,1,50,1],[52,0,59,0],[52,1,59,1],[7,0,14,0],[7,1,14,1],[16,0,23,0],[16,1,23,1],[25,1,32,1],[25,0,32,0],[0,0,1,1],[0,2,0,4],[1,2,1,4],[2,0,2,4],[3,0,5,0],[3,1,5,1],[3,2,3,4],[4,4,5,4],[4,2,5,2],[4,3,5,3],[214,1,221,1],[250,0,257,0],[250,1,257,1],[259,0,266,0],[259,1,266,1],[214,0,221,0],[223,0,230,0],[223,1,230,1],[232,0,239,0],[232,1,239,1],[241,0,248,0],[241,1,248,1],[187,0,194,0],[187,1,194,1],[196,0,203,0],[196,1,203,1],[205,0,212,0],[205,1,212,1]]}
[null,null,"DIAGNÓSTICO DE ROLES Y RESPONSABILIDADES"]
[null,null,{"$f":"Estructura!C2","v":"INSTITUTO DISTRITAL DE TURISMO"}]
["P: Planea o diseña la actividad     A: Aprueba la actividad o su salida (producto/servicio)    \nE: Ejecuta la actividad                     V: Verifica la actividad "]
["No. ","ASPECTO CLAVE DE ÉXITO\n(Programa, Proyecto, Proceso, Sistema, entre otros)","RESPONSABLE - CARGO"]
[null,null,"CARGO","AREA","COMPONENTE"]
[]
[]
[1,"Planeación Estratégica","Seleccione…",null,"Seleccione…"]
{"$rows_left_out":260}
{"sheet":"Formulas","index":3,"n_rows":18,"n_cols":2,"rows_kept":18,"cut":false,"hidden":true,"merged":[]}
["Opciones","Cargos"]
["Seleccione…","Seleccione…"]
["P","Representante Legal"]
["A","Secretario"]
["E","Director / Jefe de Oficina"]
["V","Coordinador"]
["P-A","Asesor"]
["P-E","Profesional"]
{"$rows_left_out":11}
{"sheet":"Segunda línea","index":4,"n_rows":36,"n_cols":21,"rows_kept":36,"cut":false,"hidden":false,"merged":[[3,20,5,20],[4,16,5,16],[4,17,5,17],[0,1,1,2],[0,3,0,19],[1,3,1,19],[3,1,3,17],[3,18,5,18],[3,19,5,19],[4,6,4,8],[4,9,5,9],[4,10,5,10],[4,11,4,15],[4,1,5,1],[4,2,5,2],[4,3,5,3],[4,4,5,4],[4,5,5,5]]}
[null,null,null,"ESTRUCTURA SEGUNDA LÍNEA DE DEFENSA"]
[null,null,null,{"$f":"Diagnóstico_RR!C2","v":"INSTITUTO DISTRITAL DE TURISMO"}]
[]
[null,"SEGUNDA LÍNEA DE DEFENSA",null,null,null,null,null,null,null,null,null,null,null,null,null,null,null,null,"TERCERA LÍNEA DE DEFENSA\n(Oficina de Control Interno o quien haga sus veces) ","SEGUIMIENTO CONTROL INTERNO ","Seguimiento y actualización del mapa de aseguramiento vigencia 2022"]
[null,"No. ","ASPECTO CLAVE DE ÉXITO\n(Programa, Proyecto, Proceso, Sistema, entre otros)","Riesgo asociado al aspecto clave de éxito","Responsable","Area Funcional","Criterios para la identificación de la segunda línea de defensa",null,null,"Clasificación ","FUNCIONES DE\n ASEGURAMIENTO O ACTIVIDAD DE CONTROL QUE DEBE ADELANTAR\n2023","CRITERIOS EVALUADORES DE LA FUNCIÓN DE ASEGURAMIENTO",null,null,null,null,"NIVEL DE \nCONFIANZA","OBSERVACIÓN"]
[null,null,null,null,null,null,"¿Pertenece a la Media o Alta Gerencia?","¿Responde ante la Alta Dirección?","¿Realiza actividades de seguimiento?",null,null,"Objetivo y Alcance  de la función de aseguramiento\n(20%)","Metodología\n(30%)","Responsable\n(30%)","Comunicación de resultados \n(20%)","Total"]
[{"$f":"CONCATENATE(J7,B7)","v":"Segunda Línea de Defensa1"},1,"PROCESO DIRECCIONAMIENTO ESTRATÉGICO Y PLANEACIÓN\nCumplimiento de metas del Plan de Desarrollo Distrital","Afectación a la imagen institucional y sanciones por incumplimiento a las metas institucionales, debido a cambios en los planes, programas y proyectos establecidos en la planeación estratégica","Direccionamiento Estratégico y Planeación","Direccionamiento Estratégico y Planeación","X","X","X","Segunda Línea de Defensa","*Realizar el seguimiento a las metas institucionales para controlar la ejecución de los proyectos de inversión. Esta actividad se realizará de manera trimestral.\n",5,4,5,4,{"$f":"(L7*0.2)+(M7*0.3)+(N7*0.3)+(O7*0.2)","v":4.5},{"$f":"IF(P7<0.9,\" \",IF(P7<3,\"Bajo Aseguramiento\",IF(P7<4,\"Medio Aseguramiento\",\"Alto Aseguramiento\")))","v":"Alto Aseguramiento"},{"$f":"VLOOKUP(Q7,Hoja2!$I$3:$O$8,2,0)","v":"La Oficina de Control Interno o quien haga sus veces confiará en los resultados del aseguramiento de la 2ª línea y basado en sus informes, auditará la efectividad de dicha función, evitando evaluar los controles de la 1ª línea."},{"$f":"IFERROR(VLOOKUP(Q7,Hoja2!$I$9:$O$13,2,0),\" \")","v":" "},"15/09/2021. Seguimiento realizado por Luisa Duarte y Diana Amaya conforme a las evidencias remitidas por el proceso de Direccionamiento Estratégico. \n\nAl verificar las gestiones adelantadas por el proceso, se observa que no se ha llevado a cabo la elaboración del Tablero de control para establecer alertas frente a los resultados del seguimiento a la Planeación Estratégica, para la oportuna toma de decisiones, lo anterior teniendo en cuenta que el aplicativo se encuentra en etapa de ajustes e implementación para lo cual  se cuenta con la información en un repositorio de datos en google sheets, y consecuentemente a la fecha se vienen generando los informes semanales y mensuales de seguimiento al presupuesto y a las metas del PDD, pero aún no se cuenta con el 100% de la herramienta desarrollada. \n\nAsí las cosas, el proceso solicita que esta actividad sea reprogramada al 30 de octubre de 2021. \n\nReprogramar 30/10/2021. ","*Se consolida  dentro de las funciones de aseguramiento la Resolución No. 221 de 2021 \"Por la cual se establecen las mesas de seguimiento a los Proyectos de Inversión en el Instituto Distrital de Turismo\".\n\n* Se incorporan dos actividades dentro de las funciones de aseguramiento referentes a:\n\n*Hacer seguimiento, control y vigilancia a la ejecución de los Proyectos de Inversión a través de mesas de trabajo mensual con los Gerentes de Proyecto, para identificar obstáculos que impidan el cumplimiento de las metas y la ejecución presupuestal, esto para la generación de alertas y toma oportuna de decisiones. (Evidencia actas de reunión mensual a partir del mes febrero 2022).\n\n*Realizar mesas de trabajo al interior del grupo de trabajo de FONDETUR para realizar control y vigilancia a la ejecución de las convocatorias, con el fin de garantizar una correcta ejecución de cada una de ellas, según la fase de planeación. (Evidencia actas de reunión cuando se ameriten).\n"]
["Segunda Línea de Defensa2",2,"PROCESO DIRECCIONAMIENTO ESTRATÉGICO Y PLANEACIÓN\nEficiencia y eficacia en la ejecución del presupuesto asignado a nivel de giros.","Afectación a la imagen institucional y sanciones por incumplimiento a las metas institucionales, debido a cambios en los planes, programas y proyectos establecidos en la planeación estratégica","Direccionamiento Estratégico y Planeación","Direccionamiento Estratégico y Planeación","X","X","X","Segunda Línea de Defensa","*Realizar el seguimiento a la ejecución del presupuesto a nivel de giros, para dar cumplimiento a las metas de cada proyecto. Esta actividad se realizará de manera trimestral.",5,4,5,4,4.5,"Alto Aseguramiento",{"$f":"VLOOKUP(Q8,Hoja2!$I$3:$O$8,2,0)","v":"La Oficina de Control Interno o quien haga sus veces confiará en los resultados del aseguramiento de la 2ª línea y basado en sus informes, auditará la efectividad de dicha función, evitando evaluar los controles de la 1ª línea."},{"$f":"IFERROR(VLOOKUP(Q8,Hoja2!$I$9:$O$13,2,0),\" \")","v":" "},"15/09/2021. Seguimiento realizado por Luisa Duarte y Diana Amaya conforme a las evidencias remitidas por el proceso de Direccionamiento Estratégico. \n\nAl verificar las gestiones adelantadas por el proceso, se observa que no se ha llevado a cabo la elaboración del Tablero de control para evidenciar el nivel de ejecución de giros frente al nivel de ejecución de metas y establecer la oportuna toma de decisiones, lo anterior teniendo en cuenta que el aplicativo se encuentra en etapa de ajustes e implementación para lo cual  se cuenta con la información en un repositorio de datos en google sheets, y consecuentemente a la fecha se vienen generando los informes semanales y mensuales de seguimiento al presupuesto y a las metas del PDD, pero aún no se cuenta con el 100% de la herramienta desarrollada. \n\nAsí las cosas, el proceso solicita que esta actividad sea reprogramada al 30 de octubre de 2021. \n\nReprogramar 30/10/2021. ","* Se consolida  dentro de las funciones de aseguramiento el Tablero de Control para evidenciar el nivel de ejecución de giros frente al nivel de ejecución de metas y establecer la oportuna toma de decisiones.\n\n*Se incorporan dos actividades dentro de las funciones de aseguramiento referentes a: \n\n*Hacer seguimiento, control y vigilancia a la ejecución de los proyectos de inversión a través de mesas de trabajo mensual con los Gerentes de Proyecto, para identificar obstáculos que impidan el cumplimiento de las metas y la ejecución presupuestal, esto para la generación de alertas y toma oportuna de decisiones. (Evidencia Actas de Reunión mensual a partir del mes febrero 2022).\n"]
{"$rows_left_out":29}
{"sheet":"Mapa de Aseguramiento","index":5,"n_rows":35,"n_cols":8,"rows_kept":35,"cut":false,"hidden":false,"merged":[[4,2,5,2],[4,3,5,3],[4,4,5,4],[4,5,5,5],[0,1,1,2],[0,3,0,7],[1,3,1,7],[3,1,3,5],[3,6,5,6],[3,7,5,7],[4,1,5,1]]}
[null,null,null,"MAPA DE ASEGURAMIENTO"]
[null,null,null,{"$f":"Estructura!C2","v":"INSTITUTO DISTRITAL DE TURISMO"}]
[]
[null,"SEGUNDA LÍNEA DE DEFENSA",null,null,null,null,"TERCERA LÍNEA DE DEFENSA\n(Oficina de Control Interno o quien haga sus veces) ","Rol de la Tercera Línea de Defensa"]
[null,"No. ","ASPECTO CLAVE DE ÉXITO\n(Programa, Proyecto, Proceso, Sistema, entre otros)","Riesgo asociado al aspecto clave de éxito","Responsable","Area Funcional"]
[]
[{"$f":"CONCATENATE($B$4,B7)","v":"SEGUNDA LÍNEA DE DEFENSA1"},1,{"$f":"IFERROR(VLOOKUP(A7,'Segunda línea'!$A$7:$S$36,3,FALSE),\"\")","v":"PROCESO DIRECCIONAMIENTO ESTRATÉGICO Y PLANEACIÓN\nCumplimiento de metas del Plan de Desarrollo Distrital"},{"$f":"IFERROR(VLOOKUP(A7,'Segunda línea'!$A$7:$S$36,4,FALSE),\"\")","v":"Afectación a la imagen institucional y sanciones por incumplimiento a las metas institucionales, debido a cambios en los planes, programas y proyectos establecidos en la planeación estratégica"},{"$f":"IFERROR(VLOOKUP(A7,'Segunda línea'!$A$7:$S$36,5,FALSE),\"\")","v":"Direccionamiento Estratégico y Planeación"},{"$f":"IFERROR(VLOOKUP(A7,'Segunda línea'!$A$7:$S$36,6,FALSE),\"\")","v":"Direccionamiento Estratégico y Planeación"},{"$f":"IFERROR(VLOOKUP(A7,'Segunda línea'!$A$7:$S$36,18,FALSE),\"\")","v":"La Oficina de Control Interno o quien haga sus veces confiará en los resultados del aseguramiento de la 2ª línea y basado en sus informes, auditará la efectividad de dicha función, evitando evaluar los controles de la 1ª línea."},{"$f":"IFERROR(VLOOKUP(A7,'Segunda línea'!$A$7:$S$36,19,FALSE),\"\")","v":" "}]
["SEGUNDA LÍNEA DE DEFENSA2",2,{"$f":"IFERROR(VLOOKUP(A8,'Segunda línea'!$A$7:$S$36,3,FALSE),\"\")","v":"PROCESO DIRECCIONAMIENTO ESTRATÉGICO Y PLANEACIÓN\nEficiencia y eficacia en la ejecución del presupuesto asignado a nivel de giros."},{"$f":"IFERROR(VLOOKUP(A8,'Segunda línea'!$A$7:$S$36,4,FALSE),\"\")","v":"Afectación a la imagen institucional y sanciones por incumplimiento a las metas institucionales, debido a cambios en los planes, programas y proyectos establecidos en la planeación estratégica"},{"$f":"IFERROR(VLOOKUP(A8,'Segunda línea'!$A$7:$S$36,5,FALSE),\"\")","v":"Direccionamiento Estratégico y Planeación"},{"$f":"IFERROR(VLOOKUP(A8,'Segunda línea'!$A$7:$S$36,6,FALSE),\"\")","v":"Direccionamiento Estratégico y Planeación"},{"$f":"IFERROR(VLOOKUP(A8,'Segunda línea'!$A$7:$S$36,18,FALSE),\"\")","v":"La Oficina de Control Interno o quien haga sus veces confiará en los resultados del aseguramiento de la 2ª línea y basado en sus informes, auditará la efectividad de dicha función, evitando evaluar los controles de la 1ª línea."}]
{"$rows_left_out":28}
{"sheet":"Hoja2","index":6,"n_rows":25,"n_cols":10,"rows_kept":25,"cut":false,"hidden":true,"merged":[[20,1,20,6],[2,9,2,14],[3,8,5,8],[3,9,5,14],[6,1,6,6],[6,9,6,14],[7,9,7,14],[8,9,9,14],[8,8,9,8],[10,8,11,8],[10,9,11,14],[12,9,12,14],[13,1,13,6]]}
[]
[]
[null,null,null,null,null,null,null,null,"Bajo Aseguramiento","La Oficina de Control Interno o quien haga sus veces deberá auditar y generar hallazgos y recomendaciones a la función de aseguramiento para su mejora y evaluará los controles de 1ª línea de defensa que corresponderían  a la 2ª línea de defensa."]
[null,null,null,null,null,null,null,null,"Medio Aseguramiento","La Oficina de Control Interno o quien haga sus veces deberá auditar y generar hallazgos y recomendaciones a la función de aseguramiento (2ª línea) para su mejora y evaluará los aspectos que considere relevantes de la 1ª línea de defensa."]
[]
[]
[null,"La Oficina de Control Interno o quien haga sus veces confiará en los resultados del aseguramiento de la 2ª línea y basado en sus informes, auditará la efectividad de dicha función, evitando evaluar los controles de la 1ª línea.\n",null,null,null,null,null,null,"Alto Aseguramiento","La Oficina de Control Interno o quien haga sus veces confiará en los resultados del aseguramiento de la 2ª línea y basado en sus informes, auditará la efectividad de dicha función, evitando evaluar los controles de la 1ª línea."]
[null,null,null,null,null,null,null,null," "," "]
{"$rows_left_out":17}